säilytys (ennallaan)
preferred label: storing @en
preferred label: bibehållande @sv
comment: saada jk pysymään, säilymään, pysyttää jk jonkinlaisena, muuttumattomana, ennallaan; pitää yllä
alternative label: säilytys
in scheme: conceptscheme
broader: ylläpitävä muuttaminen
type: Concept
source: Kielitoimiston sanakirja

ylläpitävä muuttaminen
preferred label: statusrelaterad förändring @sv
preferred label: change by maintaining @en
type: Concept
narrower: säilytys (ennallaan)