teollisuusneuvokset (arvonimet)
type: Concept
broader: arvonimet
comment: In singular 'teollisuussneuvos', in plural 'teollisuusneuvokset'.
preferred label: industriråd (titlar) @sv
preferred label: teollisuusneuvokset (honorary titles) @en
scope note: In singular 'teollisuusneuvos', in plural 'teollisuusneuvokset'.
alternative label: teollisuusneuvokset
in scheme: conceptscheme

arvonimet
preferred label: honorary titles @en
preferred label: hederstitlar @sv
type: Concept
narrower: teollisuusneuvokset (arvonimet)