living lab -toiminta
broader: tutkimustoiminta
scope note: Tarkoittaa tutkimustoimintaa, jossa tuotteiden ja palveluiden kehittämistyötä tehdään käyttäjälähtöisesti aidossa ympäristössä. Kehittämistyössä on mukana laaja tuotteen tai palvelun kannalta tärkeä yhteistyöverkosto
in scheme: conceptscheme
preferred label: living lab-verksamhet @sv
type: Concept

tutkimustoiminta
preferred label: forskningsverksamhet @sv
preferred label: research activity @en
type: Concept
narrower: living lab -toiminta