ruoat (ruokalajit)
preferred label: maträtter @sv
preferred label: foods @en
type: Concept
narrower: tempe

tempe
broader: ruoat (ruokalajit)
source: Kielitoimiston sanakirja
scope note: Indonesialainen keitetyistä soijapavuista käymisen avulla tehty juustomainen valmiste
related: soija
alternative label: tempeh
in scheme: conceptscheme
type: Concept

soija
preferred label: soy @en
preferred label: soja @sv
type: Concept
related: tempe