yritysyhteistyö
broader: yhteistyö
scope note: Tarkoittaa tutkimuslaitosten, korkeakoulujen, museoiden, järjestöjen yms. yhteistyötä yritysten kanssa
in scheme: conceptscheme
preferred label: företagssamarbete @sv
type: Concept

yhteistyö
preferred label: samarbete @sv
preferred label: co-operation (see by field) @en
type: Concept
narrower: yritysyhteistyö