rautatiet
preferred label: railways @en
preferred label: järnvägar @sv
type: Concept
narrower: Muurmannin rata

Muurmannin rata
broader: rautatiet
scope note: Pietarin ja Murmanskin välinen sähköistetty rautatie Venäjän luoteisosassa
in scheme: conceptscheme
type: Concept