absurdi teatteri
broader: teatteri (taidelajit)
source: http://oppimateriaali.wikidot.com/absurdi-dramaturgia
scope note: Tyylisuunta, joka kokosi yhteen useiden avantgarde-kirjoittajien, mm. Samuel Beckettin, Eugéne Ionescon, Arthur Adamovin ja Camusin tekstejä. Tyylisuunta merkitsi ensimmäistä tosiasiallista murrosta suhteessa klassiseen dramaturgiaan. Absurdi dramaturgia perustui tapahtumattomuudelle ja merkityksellisen toiminnan puutteelle
in scheme: conceptscheme
preferred label: absurd teater @sv
type: Concept

teatteri (taidelajit)
preferred label: theatre @en
preferred label: teater (konstarter) @sv
type: Concept
narrower: absurdi teatteri