Porvaristalo
broader: rakennukset
scope note: Vanha kaupunkitalo Tammisaaressa. Porvaristalo on osa Tammisaaren museon pysyvää näyttelyä
alternative label: Borgargården
in scheme: conceptscheme
type: Concept

rakennukset
preferred label: buildings @en
preferred label: byggnader @sv
type: Concept
narrower: Porvaristalo