suurjännitetekniikka
in scheme: conceptscheme
scope note: Suurjännitetekniikka käsittelee jännitteisten johtimien ympärillä olevia eristysrakenteita ja niihin kohdistuvia ylijännitteitä
type: Concept
broader: vahvavirtatekniikka
preferred label: högspänningsteknik @sv
related: sähköneristys
source: Wikipedia

vahvavirtatekniikka
preferred label: power current engineering @en
preferred label: starkströmsteknik @sv
type: Concept
narrower: suurjännitetekniikka

sähköneristys
preferred label: elektrisk isolering @sv
preferred label: electric isolation @en
type: Concept
related: suurjännitetekniikka