kaupunkiviljely
preferred label: stadsodling @sv
type: Concept
related: viherkatot

katot
preferred label: tak @sv
preferred label: roofs @en
type: Concept
narrower: viherkatot

viherkatot
related: kaupunkiviljely
scope note: Tarkoittaa kattoja, joilla voidaan kasvattaa nurmikkoa, pensaita, perennoja, köynnöksiä ja jopa puita. Katoille voidaan rakentaa myös oleskelutiloja ja leikkipaikkoja vesialtaineen ja pikku katoksineen
broader: katot
type: Concept
in scheme: conceptscheme
source: http://www.icopal.fi/Tuotteett/Viherkatot_tuotesivu.aspx
preferred label: gröna tak @sv