Sundmanin talo
broader: rakennukset
scope note: Engelin suunnittelema rakennus Helsingin Etelärannassa. Sundmanin talo on rakennettu 1800-luvun alkupuolella
in scheme: conceptscheme
type: Concept

rakennukset
preferred label: buildings @en
preferred label: byggnader @sv
type: Concept
narrower: Sundmanin talo