energiatoimistot
related: energianeuvonta
preferred label: energikontor @sv
source: Alueellinen toiminta energiatehokkuuden ja uusiutuvan energian edistämisessä -kartoitus
scope note: Energiatoimistot ovat paikallisia, erikoistuneita tietokeskuksia, jotka neuvovat ja välittävät tietoa omille alueellisille asukkailleen ja muille kohderyhmille (mm. toimittajat, opettajat, kuluttajat) , jotka tarvitsevat perustietoa energiansäästöstä ja uusiutuvista energialähteistä
in scheme: conceptscheme
type: Concept
broader: yritykset

yritykset
preferred label: företag @sv
preferred label: businesses @en
type: Concept
narrower: energiatoimistot

energianeuvonta
preferred label: energirådgivning @sv
type: Concept
related: energiatoimistot

yritykset toimialan mukaan
type: Collection
member: energiatoimistot