Second Life
broader: virtuaalimaailma
source: Wikipedia
scope note: Yksityisesti omistettu, Internetissä toimiva virtuaalimaailma. Second Lifen julkaisi vuonna 2003 Linden Lab ja sen perustaja on Philip Rosedale. Second Lifessä voi tavata muita käyttäjiä ympäri maailmaa avatarien välityksellä, vuokrata virtuaalimaata, rakentaa tai perustaa yrityksen. Second Lifellä ei ole traditionaalisia pelillisiä tavoitteita, joskin sinne on tehty myös roolipelialueita
in scheme: conceptscheme
type: Concept

virtuaalimaailma
preferred label: virtuell värld @sv
type: Concept
narrower: Second Life