korpuslingvistiikka
preferred label: corpus linguistics @en
preferred label: korpuslingvistik @sv
type: Concept
related: korpustutkimus

tutkimustoiminta
preferred label: forskningsverksamhet @sv
preferred label: research activity @en
type: Concept
narrower: korpustutkimus

korpustutkimus
preferred label: korpusundersökning @sv
related: korpuslingvistiikka
source: https://docs.google.com/viewer
in scheme: conceptscheme
broader: tutkimustoiminta
scope note: Kielitieteellinen tutkimusmenetelmä, jossa analysoidaan tietokoneavusteisesti suuria tekstimääriä, jotka on kerätty korpukseksi kutsutuksi kokoelmaksi
type: Concept