titaanit
broader: uskonnolliset ilmiöt
preferred label: titaner @sv
related: jumalat
in scheme: conceptscheme
source: Kielitoimiston sanakirja
scope note: Olympoksen jumalia vanhempi jumalsuku muinaiskreikkalaisessa mytologiassa
type: Concept

uskonnolliset ilmiöt
preferred label: religiösa fenomen @sv
preferred label: religious phenomena @en
type: Concept
narrower: titaanit

jumalat
preferred label: gods @en
preferred label: gudar @sv
type: Concept
related: titaanit