Ingmanin talo
preferred label: Ingmanska huset @sv
type: Concept
related: Casagrandentalo

Casagrandentalo
broader: rakennukset
scope note: Kulttuurihistoriallinen rakennus Turussa. Vuoteen 2002 asti talon nimi oli Ingmanin talo
related: Ingmanin talo
in scheme: conceptscheme
type: Concept

rakennukset
preferred label: buildings @en
preferred label: byggnader @sv
type: Concept
narrower: Casagrandentalo