henkilöautot
preferred label: personbilar @sv
preferred label: passenger cars @en
type: Concept
narrower: limusiinit

limusiinit
broader: henkilöautot
source: Kielitoimiston sanakirja
scope note: Iso henkilöauto (jossa on kiinteä ikkunallinen seinä etu- ja takaosan välillä)
in scheme: conceptscheme
type: Concept