uinti
preferred label: swim @en
preferred label: simning @sv
type: Concept
narrower: avovesiuinti

avovesiuinti
broader: uinti
source: Wikipedia
scope note: Uintilaji, joka tapahtuu avovedessä, kuten meressä, järvessä tai joessa
in scheme: conceptscheme
preferred label: öppet vatten-simning @sv
type: Concept