halvaus
preferred label: förlamning @sv
preferred label: paralysis @en
type: Concept
narrower: poikimahalvaus

poikimahalvaus
broader: halvaus
scope note: Yleensä lehmillä poikimisen yhteydessä esiintyvä halvaus, joka aiheutuu kalsiumaineenvaihduntahäiriöstä
in scheme: conceptscheme
type: Concept