Occupy-liike
broader: protestiliikkeet
source: Wikipedia
scope note: Protestiliike ja mielensoitus talouden valtaa vastaan Wall Streetillä New Yorkissa Yhdysvalloissa. Mielenosoitukset alkoivat 17. syyskuuta 2011. Occupy-liikkeen mielestä maan talousvaikeudet johtuvat epäonnistuneesta talouspolitiikasta sekä hallinnon ja talouden läheisistä kytköksistä
alternative label: Vallatkaa Wall Street
alternative label: Occupy Wall Street -liike
in scheme: conceptscheme
type: Concept

protestiliikkeet
preferred label: protest movements @en
preferred label: proteströrelser @sv
type: Concept
narrower: Occupy-liike