asukaspuistot
broader: puistot
source: Wikipedia
scope note: Avoin kohtaamispaikka asukkaille, jossa on lasten leikkipuistoja leluineen sekä sisätiloja, jotka ovat asukkaiden yhteisessä käytössä. Puistoissa työskentelee kaupungin työntekijöitä, jotka järjestävät asukkaille vapaan toiminnan lisäksi ohjattua toimintaa yhdessä asukkaiden kanssa
in scheme: conceptscheme
preferred label: parklekar @sv
type: Concept

puistot
preferred label: parks @en
preferred label: parker @sv
type: Concept
narrower: asukaspuistot