haute couture
broader: muoti
source: Wikipedia
scope note: Ranskassa 1700-luvulla alkunsa saanut muotitaide, jolla nykyisin viitataan kalliisiin ja korkeatasoisiin, mittatilaustyönä ja pääosin käsintehtyihin muotiluomuksiin, joita voidaan pitää taideteoksina
in scheme: conceptscheme
type: Concept

muoti
preferred label: fashion @en
preferred label: mode @sv
type: Concept
narrower: haute couture