ohjelmistoradio
broader: radiot (laitteet)
source: Wikipedia
scope note: Lähetin-vastaanotinjärjestelmä, jonka suurta osaa ominaisuuksista voidaan määritellä ohjelmallisesti
in scheme: conceptscheme
preferred label: mjukvarudefinierad radio @sv
type: Concept

radiot (laitteet)
preferred label: radios @en
preferred label: radioapparater @sv
type: Concept
narrower: ohjelmistoradio