työ työn luonteen mukaan
type: Collection
member: hajautettu työ

hajautettu työ
type: Concept
in scheme: conceptscheme
related: etätyö
source: Wikipedia
preferred label: distribuerat arbete @sv
broader: työ
scope note: Hajautettu työ on perinteistä kotona tehtävää etätyötä laajempi käsite. Hajautetulla työllä viitataan joko osittain tai kokonaan tieto- ja viestintätekniikan välityksellä tapahtuvaan työn organisointiin tietyn yhteisen tavoitteen saavuttamiseksi
alternative label: läsnätyö

etätyö
preferred label: distance work @en
preferred label: distansarbete @sv
type: Concept
related: hajautettu työ

työ
preferred label: work @en
preferred label: arbete @sv
type: Concept
narrower: hajautettu työ