infektiot
preferred label: infections @en
preferred label: infektioner @sv
type: Concept
narrower: toksoplasmoosi

toksoplasmoosi
broader: infektiot
source: Lääketieteen termit
scope note: Toxoplasma gondii ‑alkueläimen aiheuttama tauti, joka on vaarallisin sikiöllä ja vastasyntyneellä lapsella (aivo- ja silmävauriot) ja immuunikatopotilaalla (aivokalvojen, aivojen ja keuhkojen tulehdukset), mutta ilmenee myös aikuisen silmäoireina tai mononukleoosin kaltaisena tautina
in scheme: conceptscheme
type: Concept