selluloosa
preferred label: cellulosa @sv
preferred label: cellulose @en
type: Concept
narrower: nanoselluloosa

nanoselluloosa
broader: selluloosa
scope note: Nanoselluoosa on hyvin pieniksi säikeiksi kuorittua ja pilkottua perinteistä selluloosakuitua, jolloin siitä tulee geelimäistä hyytelöä. Nanoselluloosaa on mahdollista hyödyntää laajasti eri teollisuuden aloilla ja tuotteissa. Sen sovelluskohteita ovat esimerkiksi erikoispaperit, paperipinnoitteet, pakkaukset ja rakennusmateriaalit
in scheme: conceptscheme
preferred label: nanocellulosa @sv
type: Concept