sijoittajat
preferred label: investerare @sv
preferred label: investors @en
type: Concept
narrower: pääomasijoittajat

pääomasijoittajat
alternative label: yritysenkelit
alternative label: enkelisijoittajat
alternative label: bisnesenkelit
alternative label: businessenkelit
preferred label: kapitalinvesterare @sv
broader: sijoittajat
in scheme: conceptscheme
type: Concept
source: Määritelmä muokattu Wikipedian ja Suomen bisnesenkelit ry:n etusivun teksteistä
scope note: Taho, joka sijoittaa yritykseen rahaa tulemalla osaomistajaksi yritykseen. Pääomasijoittajan tärkein tavoite on saada sijoitukselleen mahdollisimman suuri taloudellinen voitto irtautumisvaiheessa. Yksityisiä pääomasijoittajia ja kanssayrittäjiä kutsutaan bisnesenkeleiksi. Bisnesenkelit sijoittavat rahaa pääasiallisesti kasvuyrityksiin