spektrografit
broader: optiset laitteet
source: Lähde: Turtia, K. Sivistyssanat
scope note: Laite, joka rekisteröi spektrin (tavallisesti valokuvana)
in scheme: conceptscheme
preferred label: spektrografer @sv
type: Concept

optiset laitteet
preferred label: optical equipment @en
preferred label: optiska instrument @sv
type: Concept
narrower: spektrografit