viralliset kielenkääntäjät
preferred label: licensed translators @en
preferred label: auktoriserade translatorer @sv
type: Concept
related: auktorisoidut kääntäjät

kääntäjät
preferred label: översättare @sv
preferred label: translators @en
type: Concept
narrower: auktorisoidut kääntäjät

auktorisoidut kääntäjät
broader: kääntäjät
scope note: Vuonna 2007 annettu laki auktorisoiduista kääntäjistä kumosi vuoden 1988 lain virallisista kääntäjistä
related: viralliset kielenkääntäjät
alternative label: auktorisoidut kielenkääntäjät
in scheme: conceptscheme
type: Concept