kirjastot
preferred label: bibliotek @sv
preferred label: libraries @en
type: Concept
narrower: yhteiskirjastot

yhteiskirjastot
broader: kirjastot
scope note: Usean yleensä samalla tai läheisellä paikkakunnalla toimivan organisaation yhteinen kirjasto, jonka toiminta ja talous perustuu organisaatioiden keskinäiseen sopimukseen ja joka tuottaa sovittuja palveluita kaikille organisaatioilleen
in scheme: conceptscheme
preferred label: sambibliotek @sv
type: Concept