kansandialektologia
broader: kansanlingvistiikka
source: Joronen, P. Ärsyttävä kieli
scope note: Kansandialektologia on erityisesti murrehavaintoihin keskittyvä kansanlingvistiikan suuntaus
related: murteet
in scheme: conceptscheme
type: Concept

murteet
preferred label: dialects @en
preferred label: dialekter @sv
type: Concept
related: kansandialektologia

kansanlingvistiikka
preferred label: folk linguistics @en
preferred label: folklingvistik @sv
type: Concept
narrower: kansandialektologia