vakuusrahastot
broader: rahastot
source: Kielitoimiston sanakirja
scope note: Rahasto, joka turvaa pankkien vakavaraisuuden ja tallettajien oikeudet saataviinsa
in scheme: conceptscheme
preferred label: garantifonder @sv
type: Concept

rahastot
preferred label: fonder @sv
preferred label: funds @en
type: Concept
narrower: vakuusrahastot