yhteiskunnalliset järjestelmät
preferred label: samhälleliga system @sv
preferred label: societal systems @en
type: Concept
narrower: RAI-järjestelmä

RAI-järjestelmä
broader: yhteiskunnalliset järjestelmät
scope note: RAI-järjestelmä on vanhusasiakkaiden hoidon tarpeen ja laadun sekä kustannusten arviointi- ja seurantajärjestelmä
alternative label: Resident Assessment Instrument
in scheme: conceptscheme
type: Concept