talous (taloudelliset ilmiöt)
preferred label: ekonomi (ekonomiska fenomen) @sv
preferred label: economy @en
type: Concept
narrower: resurssipohjainen talous

resurssipohjainen talous
related: Zeitgeist-liike
broader: talous (taloudelliset ilmiöt)
scope note: Resurssipohjaisen talouden mukaan talouden perustana tulisi olla Maan resurssit eikä raha. Resurssipohjainen talous hyödyntää käytettävissä olevia resursseja tarjoten menetelmän, jolla luonnonvarat voidaan jakaa oikeudenmukaisimmalla, inhimillisimmällä ja tehokkaimmalla tavalla. Resurssipohjaisessa taloudessa hyödykkeet ja palvelut ovat kaikkien saatavilla ilman rahaa, luottoa, vaihtokauppaa tai muuta velan tai orjuuden muotoa
in scheme: conceptscheme
type: Concept
preferred label: resursbaserad ekonomi @sv
source: Wikipedia

Zeitgeist-liike
preferred label: Zeitgeiströrelsen @sv
type: Concept
related: resurssipohjainen talous