hutut
preferred label: Hutu people @en
preferred label: hutu @sv
broader: bantut
in scheme: conceptscheme
source: Kielitoimiston sanakirja
comment: eräs Ruandassa ja Burundissa elävä bantukansa
type: Concept

bantut
preferred label: Bantu peoples @en
preferred label: bantufolk @sv
type: Concept
narrower: hutut