varusteet
preferred label: equipment @en
preferred label: utrustning @sv
type: Concept
narrower: kilvet (varusteet)

kilvet (varusteet)
type: Concept
in scheme: conceptscheme
alternative label: kilvet
comment: lyönneiltä, pistoilta yms. suojaava levymäinen, tavallisesti kädessä pidettävä varuste
source: Suomen kielen perussanakirja
preferred label: sköldar (utrustning) @sv
preferred label: shields @en
broader: varusteet