kasvunsääteet
preferred label: growth regulators @en
preferred label: tillväxtregulatorer @sv
comment: ryhmä synteettisesti valmistettuja orgaanisia yhdisteitä, joita käytetään hillitsemään hyötykasvien pituuskasvua
in scheme: conceptscheme
related: kasvihormonit
broader: aine
type: Concept
source: Biologian sanakirja

aine
preferred label: matter @en
preferred label: materia @sv
type: Concept
narrower: kasvunsääteet

kasvihormonit
preferred label: plant hormones @en
preferred label: växthormoner @sv
type: Concept
related: kasvunsääteet

aine vaikutuksen mukaan
preferred label: ämne enligt påverkan @sv
type: Collection
member: kasvunsääteet