concrete inanimate object
preferred label: konkret icke-levande objekt @sv
preferred label: konkreettinen eloton objekti @fi
type: Concept
narrower: baskets

baskets
broader: concrete inanimate object
type: Concept
preferred label: korgar @sv
preferred label: korit (kanto- tai säilytysväline) @fi
source: Suomen kielen perussanakirja
comment: päreistä, pajunvitsoista, muovista tms. tehty, tav. sangallinen kanto- tai säilytysväline, koppa, vasu
in scheme: conceptscheme