rätt
preferred label: oikeus (erikoisala) @fi
preferred label: law @en
type: Concept
narrower: krigsrätt

krigsrätt
preferred label: sotaoikeus @fi
preferred label: military law @en
broader: rätt
scope note: Tarkoittaa oikeudenalaa. Sotatilan aikana asetetusta tuomioistuimesta käytä termiä sotatuomioistuimet
scope note: Avser rättsområde. Under krigstid användes termen krigsdomstolar
type: Concept
in scheme: conceptscheme