rakennukset
preferred label: buildings @en
preferred label: byggnader @sv
type: Concept
narrower: Junnila

Junnila
broader: rakennukset
source: Lähde:Pakkanen,J., Reposaaren Junnila
scope note: Apteekkari Robert Aleksander Junneliuksen rakennuttama huvila Porin Reposaaressa, nykyisin seurakunnan leirikeskus
alternative label: Junnela
in scheme: conceptscheme
type: Concept