senior accountants
broader: occupations
comment: taloushallinnon virkailija, lähinnä kirjanpidon tai rahavarojen valvoja
in scheme: conceptscheme
preferred label: kamrerer @sv
preferred label: kamreerit @fi
type: Concept

occupations
preferred label: yrken @sv
preferred label: ammatit @fi
type: Concept
narrower: senior accountants