matter
preferred label: aine @fi
preferred label: materia @sv
type: Concept
narrower: pitch

pitch
in scheme: conceptscheme
preferred label: beck @sv
preferred label: piki @fi
type: Concept
broader: matter
related: bitumen
comment: puuta, turvetta, hartsia tm. org. yhdistettä tislattaessa syntyvä tumma jähmeä tislausjäännös
source: Kielitoimiston sanakirja

bitumen
preferred label: bitumi @fi
type: Concept
related: pitch