fiske
preferred label: kalastus (pyynti) @fi
preferred label: fishing @en
type: Concept
narrower: elfiske

provfiske
preferred label: exploratory fishing @en
preferred label: koekalastus @fi
type: Concept
related: elfiske

elfiske
in scheme: conceptscheme
preferred label: electrofishing @en
preferred label: sähkökalastus @fi
type: Concept
related: provfiske
scope note: Tarkoittaa kalabiologista tutkimusmenetelmää
scope note: Fiskfaunan i vattendrag undersöks med elfiske.
broader: fiske