sexualmedicin
preferred label: sexual medicine @en
preferred label: seksuaalilääketiede @fi
type: Concept
related: sexualhälsa

hälsa
preferred label: health @en
preferred label: terveys @fi
type: Concept
narrower: sexualhälsa

sexualhälsa
in scheme: conceptscheme
preferred label: sexual health @en
preferred label: seksuaaliterveys @fi
type: Concept
broader: hälsa
scope note: Kvinnans och mannens sexuella välbefinnande och hälsa och innebär individens rätt att få njuta av sin sexualitet, utan att det psykiskt eller kroppsligt skadar individen själv eller någon annan
scope note: Tarkoittaa naisten ja miesten elinaikaista seksuaalista hyvinvointia ja terveyttä. Seksuaaliterveys voidaan määritellä yksilön oikeudeksi nauttia omasta seksuaalisuudestaan ilman, että siitä on henkistä tai ruumiillista haittaa itselle tai muille
related: sexualmedicin
related: reproduktiv hälsa

reproduktiv hälsa
preferred label: reproductive health @en
preferred label: lisääntymisterveys @fi
type: Concept
related: sexualhälsa