handlingsteori
scope note: På engelska action theory, inte samma sak som aktivitetsteori (activity theory, theory of action)
scope note: Englanniksi action theory, eri asia kuin toiminnan teoria (activity theory, theory of action)
in scheme: conceptscheme
preferred label: toimintateoria @fi
preferred label: action theory @en
related: aktivitetsteori
broader: teorier (alster)
type: Concept

teorier (alster)
preferred label: teoriat (tuotokset) @fi
preferred label: theories @en
type: Concept
narrower: handlingsteori

aktivitetsteori
preferred label: activity theory @en
preferred label: toiminnan teoria @fi
type: Concept
related: handlingsteori