serpentinsten
broader: metamorfiska stenar
preferred label: serpentiinikivi @fi
preferred label: serpentine @en
comment: pääosin serpentiiniryhmän mineraaleista koostuva kivilaji, joka on syntynyt oliviinikiven muuttumisen tuloksena.
in scheme: conceptscheme
type: Concept
source: Kielitoimiston sanakirja

metamorfiska stenar
preferred label: metamorphic rocks @en
preferred label: metamorfiset kivet @fi
type: Concept
narrower: serpentinsten