arter (roll)
preferred label: lajit (rooli) @fi
preferred label: species @en
type: Concept
narrower: lantsorter

lantsorter
broader: arter (roll)
type: Concept
alternative label: lokalsorter
alternative label: mormorsväxter
alternative label: landsorter
alternative label: endemiska arter
alternative label: lokal sorter
alternative label: gammaldagsväxter
source: EELA
preferred label: native varieties @en
preferred label: maatiaislajikkeet @fi
in scheme: conceptscheme
related: växter
comment: Maatiaiskasvit ovat lajikkeita, jotka vuosisatojen saatossa ovat luonnonvalinnan seurauksena sopeutuneet paikallisiin kasvuolosuhteisiin. Maatiaiskasveja voi syntyä edelleenkin, eli ne eivät välttämättä ole vanhoja.

växter
preferred label: plants @en
preferred label: kasvit @fi
type: Concept
related: lantsorter