samhälleliga alster
preferred label: societal accomplishments @en
preferred label: yhteiskunnalliset tuotokset @fi
type: Concept
narrower: taktik

taktik
comment: 1) (sot.) tapa käyttää joukkoja ja taisteluvälineitä taistelun päämäärän saavuttamiseksi; taistelutaito; 2) suunnitelmallinen menettely, strategia
type: Concept
broader: samhälleliga alster
source: Suomen kielen perussanakirja
preferred label: tactics @en
preferred label: taktiikka @fi
related: strategi
in scheme: conceptscheme

strategi
preferred label: strategy @en
preferred label: strategia @fi
type: Concept
related: taktik