matter
preferred label: aine @fi
preferred label: materia @sv
type: Concept
narrower: molasses

molasses
broader: matter
preferred label: melass @sv
preferred label: melassi @fi
type: Concept
in scheme: conceptscheme
comment: sokerin ja alkoholin valmistuksessa sekä karjanruokana ja siirappina käytettävä seos, jotan saadaan esim. sokerijuurikkaista
alternative label: treackle
source: Biologian sanakirja