spiritualismi (filosofian)
comment: Filosofiassa spiritualismi on oppi, jonka mukaan todellisuus on luonteeltaan henkistä.
scope note: Sanalla on monia merkityksiä. 1) Filosofiassa spiritualismi on oppi, jonka mukaan todellisuus on luonteeltaan henkistä. 2) Teologiassa spiritualismi on näkemys, jonka mukaan yhteys Jumalaan on tärkeämpi kuin ulkoinen kirkko, Raamattu ja sakramentit
preferred label: spiritualism (filosofi) @sv
preferred label: spiritualism @en
broader: teoriat (tuotokset)
related: idealismi (teoriat)
related: henki (filosofian käsitteet)
alternative label: spiritualismi
type: Concept
in scheme: conceptscheme

henki (filosofian käsitteet)
preferred label: ande (andlig kraft) @sv
preferred label: spirit @en
type: Concept
related: spiritualismi (filosofian)

teoriat (tuotokset)
preferred label: teorier (alster) @sv
preferred label: theories @en
type: Concept
narrower: spiritualismi (filosofian)

idealismi (teoriat)
preferred label: idealism (teorier) @sv
preferred label: idealism (theories) @en
type: Concept
related: spiritualismi (filosofian)